Reaction Details
TargetCarbonic anhydrase 1
LigandBDBM50022093
Substrate/Competitorn/a
Meas. Tech.ChEMBL_1367455 (CHEMBL3300908)
Ki 66±n/a nM
Citation Ghorab, MMAlsaid, MSCeruso, MNissan, YMSupuran, CT Carbonic anhydrase inhibitors: Synthesis, molecular docking, cytotoxic and inhibition of the human carbonic anhydrase isoforms I, II, IX, XII with novel benzenesulfonamides incorporating pyrrole, pyrrolopyrimidine and fused pyrrolopyrimidine moieties. Bioorg Med Chem22:3684-95 (2014) 
 
Carbonic anhydrase 1
Name:Carbonic anhydrase 1
Type:Enzyme
Mol. Mass.:28873.37
Organism:Homo sapiens (Human)
Description:P00915
Residue:261
BDBM50022093
NameBDBM50022093
Synonyms:CHEMBL3298347
TypeSmall organic molecule
Emp. Form.C22H17BrN6O4S
Mol. Mass.541.377
SMILESCCOC(=O)c1nc2c3c(cn(-c4ccc(cc4)S(N)(=O)=O)c3ncn2n1)-c1ccc(Br)cc1