Reaction Details
TargetCarbonic anhydrase 1
LigandBDBM50022096
Substrate/Competitorn/a
Meas. Tech.ChEMBL_1367455 (CHEMBL3300908)
Ki 23±n/a nM
Citation Ghorab, MMAlsaid, MSCeruso, MNissan, YMSupuran, CT Carbonic anhydrase inhibitors: Synthesis, molecular docking, cytotoxic and inhibition of the human carbonic anhydrase isoforms I, II, IX, XII with novel benzenesulfonamides incorporating pyrrole, pyrrolopyrimidine and fused pyrrolopyrimidine moieties. Bioorg Med Chem22:3684-95 (2014) 
 
Carbonic anhydrase 1
Name:Carbonic anhydrase 1
Type:Enzyme
Mol. Mass.:28873.37
Organism:Homo sapiens (Human)
Description:P00915
Residue:261
BDBM50022096
NameBDBM50022096
Synonyms:CHEMBL3298350
TypeSmall organic molecule
Emp. Form.C22H17BrN6O5S
Mol. Mass.557.377
SMILESCCOC(=O)n1n2cnc3n(cc(-c4ccc(Br)cc4)c3c2nc1=O)-c1ccc(cc1)S(N)(=O)=O