Reaction Details
TargetCarbonic anhydrase 1
LigandBDBM50022097
Substrate/Competitorn/a
Meas. Tech.ChEMBL_1367455 (CHEMBL3300908)
Ki 28±n/a nM
Citation Ghorab, MMAlsaid, MSCeruso, MNissan, YMSupuran, CT Carbonic anhydrase inhibitors: Synthesis, molecular docking, cytotoxic and inhibition of the human carbonic anhydrase isoforms I, II, IX, XII with novel benzenesulfonamides incorporating pyrrole, pyrrolopyrimidine and fused pyrrolopyrimidine moieties. Bioorg Med Chem22:3684-95 (2014) 
 
Carbonic anhydrase 1
Name:Carbonic anhydrase 1
Type:Enzyme
Mol. Mass.:28873.37
Organism:Homo sapiens (Human)
Description:P00915
Residue:261
BDBM50022097
NameBDBM50022097
Synonyms:CHEMBL3298351
TypeSmall organic molecule
Emp. Form.C18H12BrN7O2S
Mol. Mass.470.303
SMILESNS(=O)(=O)c1ccc(cc1)-n1cc(-c2ccc(Br)cc2)c2c3nnnn3cnc12