Reaction Details
TargetCarbonic anhydrase 2
LigandBDBM50022091
Substrate/Competitorn/a
Meas. Tech.ChEMBL_1367456 (CHEMBL3300909)
Ki 3.8±n/a nM
Citation Ghorab, MMAlsaid, MSCeruso, MNissan, YMSupuran, CT Carbonic anhydrase inhibitors: Synthesis, molecular docking, cytotoxic and inhibition of the human carbonic anhydrase isoforms I, II, IX, XII with novel benzenesulfonamides incorporating pyrrole, pyrrolopyrimidine and fused pyrrolopyrimidine moieties. Bioorg Med Chem22:3684-95 (2014) 
 
Carbonic anhydrase 2
Name:Carbonic anhydrase 2
Type:Enzyme
Mol. Mass.:29250.71
Organism:Homo sapiens (Human)
Description:P00918
Residue:260
BDBM50022091
NameBDBM50022091
Synonyms:CHEMBL3298345
TypeSmall organic molecule
Emp. Form.C18H15BrN6O2S
Mol. Mass.459.32
SMILESNn1cnc2n(cc(-c3ccc(Br)cc3)c2c1=N)-c1ccc(cc1)S(N)(=O)=O