Reaction Details
TargetCarbonic anhydrase 2
LigandBDBM50022092
Substrate/Competitorn/a
Meas. Tech.ChEMBL_1367456 (CHEMBL3300909)
Ki 4.9±n/a nM
Citation Ghorab, MMAlsaid, MSCeruso, MNissan, YMSupuran, CT Carbonic anhydrase inhibitors: Synthesis, molecular docking, cytotoxic and inhibition of the human carbonic anhydrase isoforms I, II, IX, XII with novel benzenesulfonamides incorporating pyrrole, pyrrolopyrimidine and fused pyrrolopyrimidine moieties. Bioorg Med Chem22:3684-95 (2014) 
 
Carbonic anhydrase 2
Name:Carbonic anhydrase 2
Type:Enzyme
Mol. Mass.:29250.71
Organism:Homo sapiens (Human)
Description:P00918
Residue:260
BDBM50022092
NameBDBM50022092
Synonyms:CHEMBL3298346
TypeSmall organic molecule
Emp. Form.C21H14BrN7O2S
Mol. Mass.508.351
SMILESNc1nn2cnc3n(cc(-c4ccc(Br)cc4)c3c2c1C#N)-c1ccc(cc1)S(N)(=O)=O