Reaction Details
TargetCarbonic anhydrase 9
LigandBDBM50022098
Substrate/Competitorn/a
Meas. Tech.ChEMBL_1367457 (CHEMBL3300910)
Ki 12±n/a nM
Citation Ghorab, MMAlsaid, MSCeruso, MNissan, YMSupuran, CT Carbonic anhydrase inhibitors: Synthesis, molecular docking, cytotoxic and inhibition of the human carbonic anhydrase isoforms I, II, IX, XII with novel benzenesulfonamides incorporating pyrrole, pyrrolopyrimidine and fused pyrrolopyrimidine moieties. Bioorg Med Chem22:3684-95 (2014) 
 
Carbonic anhydrase 9
Name:Carbonic anhydrase 9
Type:Enzyme
Mol. Mass.:49669.03
Organism:Homo sapiens (Human)
Description:Catalytic domain of human cloned isozyme was used in the assay
Residue:459
BDBM50022098
NameBDBM50022098
Synonyms:CHEMBL3298352
TypeSmall organic molecule
Emp. Form.C20H15BrN6O3S
Mol. Mass.499.34
SMILESNS(=O)(=O)c1ccc(cc1)-n1cc(c2c1N=CN1NC(=O)CN=C21)-c1ccc(Br)cc1