Reaction Details
TargetCarbonic anhydrase 9
LigandBDBM50022100
Substrate/Competitorn/a
Meas. Tech.ChEMBL_1367457 (CHEMBL3300910)
Ki 50±n/a nM
Citation Ghorab, MMAlsaid, MSCeruso, MNissan, YMSupuran, CT Carbonic anhydrase inhibitors: Synthesis, molecular docking, cytotoxic and inhibition of the human carbonic anhydrase isoforms I, II, IX, XII with novel benzenesulfonamides incorporating pyrrole, pyrrolopyrimidine and fused pyrrolopyrimidine moieties. Bioorg Med Chem22:3684-95 (2014) 
 
Carbonic anhydrase 9
Name:Carbonic anhydrase 9
Type:Enzyme
Mol. Mass.:49669.03
Organism:Homo sapiens (Human)
Description:Catalytic domain of human cloned isozyme was used in the assay
Residue:459
BDBM50022100
NameBDBM50022100
Synonyms:CHEMBL3298354
TypeSmall organic molecule
Emp. Form.C23H19BrN6O2S
Mol. Mass.523.405
SMILESCC1=CC(C)=NN2C=Nc3c(c(cn3-c3ccc(cc3)S(N)(=O)=O)-c3ccc(Br)cc3)C2=N1