Reaction Details
TargetVascular endothelial growth factor receptor 2
LigandBDBM50022546
Substrate/Competitorn/a
Meas. Tech.ChEMBL_1368205 (CHEMBL3299341)
IC50 43±n/a nM
Citation Zhang, XRaghavan, SIhnat, MThorpe, JEDisch, BCBastian, ABailey-Downs, LCDybdal-Hargreaves, NFRohena, CCHamel, EMooberry, SLGangjee, A The design and discovery of water soluble 4-substituted-2,6-dimethylfuro[2,3-d]pyrimidines as multitargeted receptor tyrosine kinase inhibitors and microtubule targeting antitumor agents. Bioorg Med Chem22:3753-72 (2014) 
 
Vascular endothelial growth factor receptor 2
Name:Vascular endothelial growth factor receptor 2
Type:Receptor Tyrosine Kinase
Mol. Mass.:151510.97
Organism:Homo sapiens (Human)
Description:P35968
Residue:1356
BDBM50022546
NameBDBM50022546
Synonyms:CHEMBL3297897
TypeSmall organic molecule
Emp. Form.C15H15N3O2
Mol. Mass.269.2985
SMILESCOc1ccc(Nc2nc(C)nc3oc(C)cc23)cc1