Reaction Details
TargetEpidermal growth factor receptor
LigandBDBM50022542
Substrate/Competitorn/a
Meas. Tech.ChEMBL_1368204 (CHEMBL3299340)
IC50 68±n/a nM
Citation Zhang, XRaghavan, SIhnat, MThorpe, JEDisch, BCBastian, ABailey-Downs, LCDybdal-Hargreaves, NFRohena, CCHamel, EMooberry, SLGangjee, A The design and discovery of water soluble 4-substituted-2,6-dimethylfuro[2,3-d]pyrimidines as multitargeted receptor tyrosine kinase inhibitors and microtubule targeting antitumor agents. Bioorg Med Chem22:3753-72 (2014) 
 
Epidermal growth factor receptor
Name:Epidermal growth factor receptor
Type:Receptor Kinase Domain
Mol. Mass.:134279.59
Organism:Homo sapiens (Human)
Description:P00533
Residue:1210
BDBM50022542
NameBDBM50022542
Synonyms:CHEMBL3297898 | US10189853, Compound 1
TypeSmall organic molecule
Emp. Form.C16H17N3O2
Mol. Mass.283.3251
SMILESCOc1ccc(cc1)N(C)c1nc(C)nc2oc(C)cc12