Reaction Details
TargetFarnesyl pyrophosphate synthase
LigandBDBM50138725
Substrate/Competitorn/a
Meas. Tech.ChEMBL_1368841
IC50 200±n/a nM
Citation De Schutter, JWPark, JLeung, CYGormley, PLin, YSHu, ZBerghuis, AMPoirier, JTsantrizos, YS Multistage screening reveals chameleon ligands of the human farnesyl pyrophosphate synthase: implications to drug discovery for neurodegenerative diseases. J Med Chem57:5764-76 (2014) 
 
Farnesyl pyrophosphate synthase
Name:Farnesyl pyrophosphate synthase
Type:Enzyme
Mol. Mass.:48272.89
Organism:Homo sapiens (Human)
Description:P14324
Residue:419
BDBM50138725
NameBDBM50138725
Synonyms:(1-phosphono-2-pyridin-3-yl-ethyl)-phosphonic acid | CHEMBL98110
TypeSmall organic molecule
Emp. Form.C7H11NO6P2
Mol. Mass.267.1129
SMILESOP(O)(=O)C(Cc1cccnc1)P(O)(O)=O