Reaction Details
TargetFarnesyl pyrophosphate synthase
LigandBDBM50373092
Substrate/Competitorn/a
Meas. Tech.ChEMBL_1368841
IC50 200±n/a nM
Citation De Schutter, JWPark, JLeung, CYGormley, PLin, YSHu, ZBerghuis, AMPoirier, JTsantrizos, YS Multistage screening reveals chameleon ligands of the human farnesyl pyrophosphate synthase: implications to drug discovery for neurodegenerative diseases. J Med Chem57:5764-76 (2014) 
 
Farnesyl pyrophosphate synthase
Name:Farnesyl pyrophosphate synthase
Type:Enzyme
Mol. Mass.:48272.89
Organism:Homo sapiens (Human)
Description:P14324
Residue:419
BDBM50373092
NameBDBM50373092
Synonyms:CHEMBL261311
TypeSmall organic molecule
Emp. Form.C7H10NO3P
Mol. Mass.187.133
SMILESOP(O)(=O)CCc1cccnc1