Reaction Details
TargetFarnesyl pyrophosphate synthase
LigandBDBM50022664
Substrate/Competitorn/a
Meas. Tech.ChEMBL_1368838
IC50>20000±n/a nM
Citation De Schutter, JWPark, JLeung, CYGormley, PLin, YSHu, ZBerghuis, AMPoirier, JTsantrizos, YS Multistage screening reveals chameleon ligands of the human farnesyl pyrophosphate synthase: implications to drug discovery for neurodegenerative diseases. J Med Chem57:5764-76 (2014) 
 
Farnesyl pyrophosphate synthase
Name:Farnesyl pyrophosphate synthase
Type:Enzyme
Mol. Mass.:48272.89
Organism:Homo sapiens (Human)
Description:P14324
Residue:419
BDBM50022664
NameBDBM50022664
Synonyms:CHEMBL3299048
TypeSmall organic molecule
Emp. Form.C15H16N3O3PS
Mol. Mass.349.345
SMILESCc1ccc(cc1)-c1cc2c(NCCP(O)(O)=O)ncnc2s1