Reaction Details
TargetFarnesyl pyrophosphate synthase
LigandBDBM36510
Substrate/Competitorn/a
Meas. Tech.ChEMBL_1368838
IC50 920±n/a nM
Citation De Schutter, JWPark, JLeung, CYGormley, PLin, YSHu, ZBerghuis, AMPoirier, JTsantrizos, YS Multistage screening reveals chameleon ligands of the human farnesyl pyrophosphate synthase: implications to drug discovery for neurodegenerative diseases. J Med Chem57:5764-76 (2014) 
 
Farnesyl pyrophosphate synthase
Name:Farnesyl pyrophosphate synthase
Type:Enzyme
Mol. Mass.:48272.89
Organism:Homo sapiens (Human)
Description:P14324
Residue:419
BDBM36510
NameBDBM36510
Synonyms:1-(Carboxymethyl)-1H-benzo[g]indole-2-carboxylic acid, 11 | CID46398840
TypeSmall organic molecule
Emp. Form.C15H11NO4
Mol. Mass.269.2521
SMILESOC(=O)Cn1c(cc2ccc3ccccc3c12)C(O)=O