Reaction Details
TargetHigh affinity nerve growth factor receptor
LigandBDBM50022675
Substrate/Competitorn/a
Meas. Tech.ChEMBL_1368860 (CHEMBL3299482)
Kd 0.940000±n/a nM
Citation Stachel, SJSanders, JMHenze, DARudd, MTSu, HPLi, YNanda, KKEgbertson, MSManley, PJJones, KLBrnardic, EJGreen, AGrobler, JAHanney, BLeitl, MLai, MTMunshi, VMurphy, DRickert, KRiley, DKrasowska-Zoladek, ADaley, CZuck, PKane, SABilodeau, MT Maximizing diversity from a kinase screen: identification of novel and selective pan-Trk inhibitors for chronic pain. J Med Chem57:5800-16 (2014) 
 
High affinity nerve growth factor receptor
Name:High affinity nerve growth factor receptor
Type:n/a
Mol. Mass.:87498.18
Organism:Homo sapiens (Human)
Description:P04629
Residue:796
BDBM50022675
NameBDBM50022675
Synonyms:CHEMBL3298268
TypeSmall organic molecule
Emp. Form.C24H24N10O
Mol. Mass.468.5138
SMILESCC(C)(C)c1cc(NC(=O)Cn2cc(nn2)-c2ccc(nc2)-n2ccnc2)n(n1)-c1cccnc1