Reaction Details
TargetChitinase
LigandBDBM50063753
Substrate/Competitorn/a
Meas. Tech.ChEMBL_1369102 (CHEMBL3300323)
Ki 470±n/a nM
Citation Gooyit, MTricoche, NLustigman, SJanda, KD Dual protonophore-chitinase inhibitors dramatically affect O. volvulus molting. J Med Chem57:5792-9 (2014) 
 
Chitinase
Name:Chitinase
Synonyms:n/a
Type:PROTEIN
Mol. Mass.:55694.80
Organism:Onchocerca volvulus
Description:ChEMBL_1369100
Residue:497
BDBM50063753
NameBDBM50063753
TypeSmall organic molecule
Emp. Form.C22H14Cl2I2N2O2
Mol. Mass.663.074
SMILESCc1cc(C(C#N)c2ccc(Cl)cc2)c(Cl)cc1NC(=O)c1cc(I)cc(I)c1O