Reaction Details
TargetAurora kinase A
LigandBDBM50022929
Substrate/Competitorn/a
Meas. Tech.ChEMBL_1369125
Ki 290±n/a nM
Citation Burch, JDLau, KBarker, JJBrookfield, FChen, YChen, YEigenbrot, CEllebrandt, CIsmaili, MHJohnson, AKordt, DMacKinnon, CHMcEwan, PAOrtwine, DFStein, DBWang, XWinkler, DYuen, PWZhang, YZarrin, AAPei, Z Property- and structure-guided discovery of a tetrahydroindazole series of interleukin-2 inducible T-cell kinase inhibitors. J Med Chem57:5714-27 (2014) 
 
Aurora kinase A
Name:Aurora kinase A
Type:Serine/threonine-protein kinase
Mol. Mass.:45830.98
Organism:Homo sapiens (Human)
Description:O14965
Residue:403
BDBM50022929
NameBDBM50022929
Synonyms:CHEMBL3298376
TypeSmall organic molecule
Emp. Form.C24H31ClN6O
Mol. Mass.454.996
SMILESCN(C)CC[C@@H](c1cccc(Cl)c1)n1cc(NC(=O)c2n[nH]c3CC(C)(C)CCc23)cn1