Reaction Details
TargetTyrosine-protein kinase ITK/TSK
LigandBDBM50022930
Substrate/Competitorn/a
Meas. Tech.ChEMBL_1369124
IC50 310±n/a nM
Citation Burch, JDLau, KBarker, JJBrookfield, FChen, YChen, YEigenbrot, CEllebrandt, CIsmaili, MHJohnson, AKordt, DMacKinnon, CHMcEwan, PAOrtwine, DFStein, DBWang, XWinkler, DYuen, PWZhang, YZarrin, AAPei, Z Property- and structure-guided discovery of a tetrahydroindazole series of interleukin-2 inducible T-cell kinase inhibitors. J Med Chem57:5714-27 (2014) 
 
Tyrosine-protein kinase ITK/TSK
Name:Tyrosine-protein kinase ITK/TSK
Type:Protein
Mol. Mass.:71839.20
Organism:Homo sapiens (Human)
Description:Q08881
Residue:620
BDBM50022930
NameBDBM50022930
Synonyms:CHEMBL3298374
TypeSmall organic molecule
Emp. Form.C23H29N5O3S
Mol. Mass.455.573
SMILESCC1(C)CCc2c(C1)[nH]nc2C(=O)Nc1cnn(c1)[C@@H](CCS(C)(=O)=O)c1ccccc1