Reaction Details
TargetAurora kinase A
LigandBDBM50022931
Substrate/Competitorn/a
Meas. Tech.ChEMBL_1369125
Ki 440±n/a nM
Citation Burch, JDLau, KBarker, JJBrookfield, FChen, YChen, YEigenbrot, CEllebrandt, CIsmaili, MHJohnson, AKordt, DMacKinnon, CHMcEwan, PAOrtwine, DFStein, DBWang, XWinkler, DYuen, PWZhang, YZarrin, AAPei, Z Property- and structure-guided discovery of a tetrahydroindazole series of interleukin-2 inducible T-cell kinase inhibitors. J Med Chem57:5714-27 (2014) 
 
Aurora kinase A
Name:Aurora kinase A
Type:Serine/threonine-protein kinase
Mol. Mass.:45830.98
Organism:Homo sapiens (Human)
Description:O14965
Residue:403
BDBM50022931
NameBDBM50022931
Synonyms:CHEMBL3298369
TypeSmall organic molecule
Emp. Form.C20H21N5O
Mol. Mass.347.4136
SMILESCC12CC1Cc1c(C2)[nH]nc1C(=O)Nc1cnn(Cc2ccccc2)c1