Reaction Details
TargetAurora kinase A
LigandBDBM50015269
Substrate/Competitorn/a
Meas. Tech.ChEMBL_1369125
Ki 870±n/a nM
Citation Burch, JDLau, KBarker, JJBrookfield, FChen, YChen, YEigenbrot, CEllebrandt, CIsmaili, MHJohnson, AKordt, DMacKinnon, CHMcEwan, PAOrtwine, DFStein, DBWang, XWinkler, DYuen, PWZhang, YZarrin, AAPei, Z Property- and structure-guided discovery of a tetrahydroindazole series of interleukin-2 inducible T-cell kinase inhibitors. J Med Chem57:5714-27 (2014) 
 
Aurora kinase A
Name:Aurora kinase A
Type:Serine/threonine-protein kinase
Mol. Mass.:45830.98
Organism:Homo sapiens (Human)
Description:O14965
Residue:403
BDBM50015269
NameBDBM50015269
Synonyms:CHEMBL3262780
TypeSmall organic molecule
Emp. Form.C19H14N6O
Mol. Mass.342.3541
SMILESO=C(Nc1cnn(Cc2cccc(c2)C#N)c1)c1n[nH]c2ccccc12