Reaction Details
TargetTyrosine-protein kinase ITK/TSK
LigandBDBM50022976
Substrate/Competitorn/a
Meas. Tech.ChEMBL_1369123
Ki 10.0±n/a nM
Citation Burch, JDLau, KBarker, JJBrookfield, FChen, YChen, YEigenbrot, CEllebrandt, CIsmaili, MHJohnson, AKordt, DMacKinnon, CHMcEwan, PAOrtwine, DFStein, DBWang, XWinkler, DYuen, PWZhang, YZarrin, AAPei, Z Property- and structure-guided discovery of a tetrahydroindazole series of interleukin-2 inducible T-cell kinase inhibitors. J Med Chem57:5714-27 (2014) 
 
Tyrosine-protein kinase ITK/TSK
Name:Tyrosine-protein kinase ITK/TSK
Type:Protein
Mol. Mass.:71839.20
Organism:Homo sapiens (Human)
Description:Q08881
Residue:620
BDBM50022976
NameBDBM50022976
Synonyms:CHEMBL3298291
TypeSmall organic molecule
Emp. Form.C20H21N5O
Mol. Mass.347.4136
SMILESO=C(Nc1cnn(Cc2ccccc2)c1)c1n[nH]c2CC3(CC3)CCc12