Reaction Details
TargetTyrosine-protein kinase ITK/TSK
LigandBDBM50015269
Substrate/Competitorn/a
Meas. Tech.ChEMBL_1369123
Ki 43±n/a nM
Citation Burch, JDLau, KBarker, JJBrookfield, FChen, YChen, YEigenbrot, CEllebrandt, CIsmaili, MHJohnson, AKordt, DMacKinnon, CHMcEwan, PAOrtwine, DFStein, DBWang, XWinkler, DYuen, PWZhang, YZarrin, AAPei, Z Property- and structure-guided discovery of a tetrahydroindazole series of interleukin-2 inducible T-cell kinase inhibitors. J Med Chem57:5714-27 (2014) 
 
Tyrosine-protein kinase ITK/TSK
Name:Tyrosine-protein kinase ITK/TSK
Type:Protein
Mol. Mass.:71839.20
Organism:Homo sapiens (Human)
Description:Q08881
Residue:620
BDBM50015269
NameBDBM50015269
Synonyms:CHEMBL3262780
TypeSmall organic molecule
Emp. Form.C19H14N6O
Mol. Mass.342.3541
SMILESO=C(Nc1cnn(Cc2cccc(c2)C#N)c1)c1n[nH]c2ccccc12