Reaction Details
TargetTyrosine-protein kinase ITK/TSK
LigandBDBM50022932
Substrate/Competitorn/a
Meas. Tech.ChEMBL_1369124
IC50 55±n/a nM
Citation Burch, JDLau, KBarker, JJBrookfield, FChen, YChen, YEigenbrot, CEllebrandt, CIsmaili, MHJohnson, AKordt, DMacKinnon, CHMcEwan, PAOrtwine, DFStein, DBWang, XWinkler, DYuen, PWZhang, YZarrin, AAPei, Z Property- and structure-guided discovery of a tetrahydroindazole series of interleukin-2 inducible T-cell kinase inhibitors. J Med Chem57:5714-27 (2014) 
 
Tyrosine-protein kinase ITK/TSK
Name:Tyrosine-protein kinase ITK/TSK
Type:Protein
Mol. Mass.:71839.20
Organism:Homo sapiens (Human)
Description:Q08881
Residue:620
BDBM50022932
NameBDBM50022932
Synonyms:CHEMBL3298371
TypeSmall organic molecule
Emp. Form.C24H32N6O
Mol. Mass.420.5505
SMILESCN(C)CC[C@@H](c1ccccc1)n1cc(NC(=O)c2n[nH]c3CC(C)(C)CCc23)cn1