Reaction Details
TargetTyrosine-protein kinase ITK/TSK
LigandBDBM50023029
Substrate/Competitorn/a
Meas. Tech.ChEMBL_1369123
Ki 75±n/a nM
Citation Burch, JDLau, KBarker, JJBrookfield, FChen, YChen, YEigenbrot, CEllebrandt, CIsmaili, MHJohnson, AKordt, DMacKinnon, CHMcEwan, PAOrtwine, DFStein, DBWang, XWinkler, DYuen, PWZhang, YZarrin, AAPei, Z Property- and structure-guided discovery of a tetrahydroindazole series of interleukin-2 inducible T-cell kinase inhibitors. J Med Chem57:5714-27 (2014) 
 
Tyrosine-protein kinase ITK/TSK
Name:Tyrosine-protein kinase ITK/TSK
Type:Protein
Mol. Mass.:71839.20
Organism:Homo sapiens (Human)
Description:Q08881
Residue:620
BDBM50023029
NameBDBM50023029
Synonyms:CHEMBL3298366
TypeSmall organic molecule
Emp. Form.C20H21N5O2
Mol. Mass.363.413
SMILESO=C(Nc1cnn(Cc2ccccc2)c1)c1n[nH]c2CC3(COC3)CCc12