Reaction Details
TargetAlpha-1D adrenergic receptor
LigandBDBM50023183
Substrate/Competitorn/a
Meas. Tech.ChEMBL_1368301 (CHEMBL3299606)
Ki 0.575440±n/a nM
Citation Romeo, GSalerno, LPittalą, VModica, MNSiracusa, MAMateria, LBuccioni, MMarucci, GMinneman, KP High affinity ligands and potent antagonists for thea1D-adrenergic receptor. Novel 3,8-disubstituted [1]benzothieno[3,2-d]pyrimidine derivatives. Eur J Med Chem83:419-32 (2014) 
 
Alpha-1D adrenergic receptor
Name:Alpha-1D adrenergic receptor
Type:Enzyme Catalytic Domain
Mol. Mass.:60485.82
Organism:Homo sapiens (Human)
Description:adrenergic Alpha1D ADRA1D HUMAN::P25100
Residue:572
BDBM50023183
NameBDBM50023183
Synonyms:CHEMBL3298745
TypeSmall organic molecule
Emp. Form.C30H29N5O4S
Mol. Mass.555.647
SMILESCOc1ccccc1N1CCN(CCn2c(=O)[nH]c3c4cc(NC(=O)c5ccccc5)ccc4sc3c2=O)CC1