Reaction Details
TargetMuscarinic acetylcholine receptor M2
LigandBDBM50023229
Substrate/Competitorn/a
Meas. Tech.ChEMBL_1457826 (CHEMBL3370304)
EC50>30000±n/a nM
Citation Gentry, PRKokubo, MBridges, TMNoetzel, MJCho, HPLamsal, ASmith, EChase, PHodder, PSNiswender, CMDaniels, JSConn, PJLindsley, CWWood, MR Development of a highly potent, novel M5 positive allosteric modulator (PAM) demonstrating CNS exposure: 1-((1H-indazol-5-yl)sulfoneyl)-N-ethyl-N-(2-(trifluoromethyl)benzyl)piperidine-4-carboxamide (ML380). J Med Chem57:7804-10 (2014) 
 
Muscarinic acetylcholine receptor M2
Name:Muscarinic acetylcholine receptor M2
Type:GPCR
Mol. Mass.:51730.61
Organism:Homo sapiens (Human)
Description:P08172
Residue:466
BDBM50023229
NameBDBM50023229
Synonyms:CHEMBL3329755
TypeSmall organic molecule
Emp. Form.C23H25F3N4O3S
Mol. Mass.494.53
SMILESCCN(Cc1ccccc1C(F)(F)F)C(=O)C1CCN(CC1)S(=O)(=O)c1ccc2[nH]ncc2c1