Reaction Details
TargetMuscarinic acetylcholine receptor M1
LigandBDBM50023229
Substrate/Competitorn/a
Meas. Tech.ChEMBL_1457832 (CHEMBL3370310)
EC50 2000±n/a nM
Citation Gentry, PRKokubo, MBridges, TMNoetzel, MJCho, HPLamsal, ASmith, EChase, PHodder, PSNiswender, CMDaniels, JSConn, PJLindsley, CWWood, MR Development of a highly potent, novel M5 positive allosteric modulator (PAM) demonstrating CNS exposure: 1-((1H-indazol-5-yl)sulfoneyl)-N-ethyl-N-(2-(trifluoromethyl)benzyl)piperidine-4-carboxamide (ML380). J Med Chem57:7804-10 (2014) 
 
Muscarinic acetylcholine receptor M1
Name:Muscarinic acetylcholine receptor M1
Type:Enzyme Catalytic Domain
Mol. Mass.:51390.46
Organism:RAT
Description:P08482
Residue:460
BDBM50023229
NameBDBM50023229
Synonyms:CHEMBL3329755
TypeSmall organic molecule
Emp. Form.C23H25F3N4O3S
Mol. Mass.494.53
SMILESCCN(Cc1ccccc1C(F)(F)F)C(=O)C1CCN(CC1)S(=O)(=O)c1ccc2[nH]ncc2c1