Reaction Details
TargetMuscarinic acetylcholine receptor M5
LigandBDBM50403547
Substrate/Competitorn/a
Meas. Tech.ChEMBL_1457838 (CHEMBL3370316)
Ki 1.5±n/a nM
Citation Gentry, PRKokubo, MBridges, TMNoetzel, MJCho, HPLamsal, ASmith, EChase, PHodder, PSNiswender, CMDaniels, JSConn, PJLindsley, CWWood, MR Development of a highly potent, novel M5 positive allosteric modulator (PAM) demonstrating CNS exposure: 1-((1H-indazol-5-yl)sulfoneyl)-N-ethyl-N-(2-(trifluoromethyl)benzyl)piperidine-4-carboxamide (ML380). J Med Chem57:7804-10 (2014) 
 
Muscarinic acetylcholine receptor M5
Name:Muscarinic acetylcholine receptor M5
Type:PROTEIN
Mol. Mass.:60102.35
Organism:Homo sapiens (Human)
Description:ChEMBL_1517990
Residue:532
BDBM50403547
NameBDBM50403547
Synonyms:ATROPEN | ATROPINE
TypeSmall organic molecule
Emp. Form.C17H23NO3
Mol. Mass.289.3694
SMILESCN1[C@H]2CC[C@@H]1C[C@@H](C2)OC(=O)C(CO)c1ccccc1