Reaction Details
TargetMuscarinic acetylcholine receptor M5
LigandBDBM50023261
Substrate/Competitorn/a
Meas. Tech.ChEMBL_1457820 (CHEMBL3370062)
EC50 155±n/a nM
Citation Gentry, PRKokubo, MBridges, TMNoetzel, MJCho, HPLamsal, ASmith, EChase, PHodder, PSNiswender, CMDaniels, JSConn, PJLindsley, CWWood, MR Development of a highly potent, novel M5 positive allosteric modulator (PAM) demonstrating CNS exposure: 1-((1H-indazol-5-yl)sulfoneyl)-N-ethyl-N-(2-(trifluoromethyl)benzyl)piperidine-4-carboxamide (ML380). J Med Chem57:7804-10 (2014) 
 
Muscarinic acetylcholine receptor M5
Name:Muscarinic acetylcholine receptor M5
Type:PROTEIN
Mol. Mass.:60102.35
Organism:Homo sapiens (Human)
Description:ChEMBL_1517990
Residue:532
BDBM50023261
NameBDBM50023261
Synonyms:CHEMBL3329756
TypeSmall organic molecule
Emp. Form.C24H27F3N4O3S
Mol. Mass.508.556
SMILESCCCN(Cc1ccccc1C(F)(F)F)C(=O)C1CCN(CC1)S(=O)(=O)c1ccc2[nH]ncc2c1