Reaction Details
Target1,25-dihydroxyvitamin D(3) 24-hydroxylase, mitochondrial
LigandBDBM50023351
Substrate/Competitorn/a
Meas. Tech.ChEMBL_1459633 (CHEMBL3369890)
Ki 91±n/a nM
Citation Ferla, SAboraia, ASBrancale, APepper, CJZhu, JOchalek, JTDeLuca, HFSimons, C Small-molecule inhibitors of 25-hydroxyvitamin D-24-hydroxylase (CYP24A1): synthesis and biological evaluation. J Med Chem57:7702-15 (2014) 
 
1,25-dihydroxyvitamin D(3) 24-hydroxylase, mitochondrial
Name:1,25-dihydroxyvitamin D(3) 24-hydroxylase, mitochondrial
Type:Protein
Mol. Mass.:58889.66
Organism:Homo sapiens (Human)
Description:Q07973
Residue:514
BDBM50023351
NameBDBM50023351
Synonyms:CHEMBL3329772
TypeSmall organic molecule
Emp. Form.C24H22N4O3S
Mol. Mass.446.521
SMILESO=C(NCC(c1ccccc1)n1ccnc1)c1ccc(cc1)S(=O)(=O)Nc1ccccc1