Reaction Details
Target1,25-dihydroxyvitamin D(3) 24-hydroxylase, mitochondrial
LigandBDBM50023358
Substrate/Competitorn/a
Meas. Tech.ChEMBL_1459633 (CHEMBL3369890)
Ki 210±n/a nM
Citation Ferla, SAboraia, ASBrancale, APepper, CJZhu, JOchalek, JTDeLuca, HFSimons, C Small-molecule inhibitors of 25-hydroxyvitamin D-24-hydroxylase (CYP24A1): synthesis and biological evaluation. J Med Chem57:7702-15 (2014) 
 
1,25-dihydroxyvitamin D(3) 24-hydroxylase, mitochondrial
Name:1,25-dihydroxyvitamin D(3) 24-hydroxylase, mitochondrial
Type:Protein
Mol. Mass.:58889.66
Organism:Homo sapiens (Human)
Description:Q07973
Residue:514
BDBM50023358
NameBDBM50023358
Synonyms:CHEMBL3329777
TypeSmall organic molecule
Emp. Form.C30H36O5S
Mol. Mass.508.669
SMILESCOc1cc(OC)cc(\C=C\c2ccc(CCC(OS(=O)(=O)c3ccc(C)cc3)C(C)(C)C)cc2)c1