Reaction Details
Target1,25-dihydroxyvitamin D(3) 24-hydroxylase, mitochondrial
LigandBDBM50322358
Substrate/Competitorn/a
Meas. Tech.ChEMBL_1459633 (CHEMBL3369890)
IC50 15±n/a nM
Citation Ferla, SAboraia, ASBrancale, APepper, CJZhu, JOchalek, JTDeLuca, HFSimons, C Small-molecule inhibitors of 25-hydroxyvitamin D-24-hydroxylase (CYP24A1): synthesis and biological evaluation. J Med Chem57:7702-15 (2014) 
 
1,25-dihydroxyvitamin D(3) 24-hydroxylase, mitochondrial
Name:1,25-dihydroxyvitamin D(3) 24-hydroxylase, mitochondrial
Type:Protein
Mol. Mass.:58889.66
Organism:Homo sapiens (Human)
Description:Q07973
Residue:514
BDBM50322358
NameBDBM50322358
Synonyms:4'-Chloro-biphenyl-4-carboxylic acid((R)-2-imidazol-1-yl-2-phenyl-ethyl)-amide | CHEMBL1170908
TypeSmall organic molecule
Emp. Form.C24H20ClN3O
Mol. Mass.401.888
SMILESClc1ccc(cc1)-c1ccc(cc1)C(=O)NC[C@@H](c1ccccc1)n1ccnc1