Reaction Details
Target25-hydroxyvitamin D-1 alpha hydroxylase, mitochondrial
LigandBDBM50023350
Substrate/Competitorn/a
Meas. Tech.ChEMBL_1459634 (CHEMBL3369891)
IC50 280±n/a nM
Citation Ferla, SAboraia, ASBrancale, APepper, CJZhu, JOchalek, JTDeLuca, HFSimons, C Small-molecule inhibitors of 25-hydroxyvitamin D-24-hydroxylase (CYP24A1): synthesis and biological evaluation. J Med Chem57:7702-15 (2014) 
 
25-hydroxyvitamin D-1 alpha hydroxylase, mitochondrial
Name:25-hydroxyvitamin D-1 alpha hydroxylase, mitochondrial
Type:PROTEIN
Mol. Mass.:56238.51
Organism:Mus musculus
Description:ChEMBL_109473
Residue:507
BDBM50023350
NameBDBM50023350
Synonyms:CHEMBL3329771
TypeSmall organic molecule
Emp. Form.C26H24FN3O
Mol. Mass.413.4867
SMILESFc1ccc(CCc2ccc(cc2)C(=O)NCC(c2ccccc2)n2ccnc2)cc1