Reaction Details
Target25-hydroxyvitamin D-1 alpha hydroxylase, mitochondrial
LigandBDBM50322357
Substrate/Competitorn/a
Meas. Tech.ChEMBL_1459634 (CHEMBL3369891)
Ki 80±n/a nM
Citation Ferla, SAboraia, ASBrancale, APepper, CJZhu, JOchalek, JTDeLuca, HFSimons, C Small-molecule inhibitors of 25-hydroxyvitamin D-24-hydroxylase (CYP24A1): synthesis and biological evaluation. J Med Chem57:7702-15 (2014) 
 
25-hydroxyvitamin D-1 alpha hydroxylase, mitochondrial
Name:25-hydroxyvitamin D-1 alpha hydroxylase, mitochondrial
Type:PROTEIN
Mol. Mass.:56238.51
Organism:Mus musculus
Description:ChEMBL_109473
Residue:507
BDBM50322357
NameBDBM50322357
Synonyms:(E)-4-N-(2-(1H-imidazol-1-yl)-2-phenylethyl)-4-styrylbenzamide | CHEMBL1171494
TypeSmall organic molecule
Emp. Form.C26H23N3O
Mol. Mass.393.4803
SMILESO=C(NCC(c1ccccc1)n1ccnc1)c1ccc(\C=C\c2ccccc2)cc1