Reaction Details
Target5-hydroxytryptamine receptor 4
LigandBDBM50023368
Substrate/Competitorn/a
Meas. Tech.ChEMBL_1460447 (CHEMBL3367331)
Ki 1.3±n/a nM
Citation Brudeli, BNavaratnarajah, MAndressen, KWManfra, OMoltzau, LRNilsen, NOLevy, FOKlaveness, J Discovery and pharmacological profile of new hydrophilic 5-HT(4) receptor antagonists. Bioorg Med Chem Lett24:4598-602 (2014) 
 
5-hydroxytryptamine receptor 4
Name:5-hydroxytryptamine receptor 4
Type:Enzyme
Mol. Mass.:43767.54
Organism:Homo sapiens (Human)
Description:Q13639
Residue:388
BDBM50023368
NameBDBM50023368
Synonyms:CHEMBL3329812
TypeSmall organic molecule
Emp. Form.C26H34N2O5
Mol. Mass.454.5586
SMILESOC(=O)C1CCCC(CN2CCC(COC(=O)c3c4OCCCn4c4ccccc34)CC2)C1