Reaction Details
Target5-hydroxytryptamine receptor 4
LigandBDBM50023369
Substrate/Competitorn/a
Meas. Tech.ChEMBL_1460447 (CHEMBL3367331)
Ki 1.6±n/a nM
Citation Brudeli, BNavaratnarajah, MAndressen, KWManfra, OMoltzau, LRNilsen, NOLevy, FOKlaveness, J Discovery and pharmacological profile of new hydrophilic 5-HT(4) receptor antagonists. Bioorg Med Chem Lett24:4598-602 (2014) 
 
5-hydroxytryptamine receptor 4
Name:5-hydroxytryptamine receptor 4
Type:Enzyme
Mol. Mass.:43767.54
Organism:Homo sapiens (Human)
Description:Q13639
Residue:388
BDBM50023369
NameBDBM50023369
Synonyms:CHEMBL3329226
TypeSmall organic molecule
Emp. Form.C27H32N2O5
Mol. Mass.464.5534
SMILESOC(=O)C1C2C3CC1C(CN1CCC(COC(=O)c4c5OCCCn5c5ccccc45)CC1)C23