Reaction Details
Target5-hydroxytryptamine receptor 4
LigandBDBM85026
Substrate/Competitorn/a
Meas. Tech.ChEMBL_1460447 (CHEMBL3367331)
Ki 0.398107±n/a nM
Citation Brudeli, BNavaratnarajah, MAndressen, KWManfra, OMoltzau, LRNilsen, NOLevy, FOKlaveness, J Discovery and pharmacological profile of new hydrophilic 5-HT(4) receptor antagonists. Bioorg Med Chem Lett24:4598-602 (2014) 
 
5-hydroxytryptamine receptor 4
Name:5-hydroxytryptamine receptor 4
Type:Enzyme
Mol. Mass.:43767.54
Organism:Homo sapiens (Human)
Description:Q13639
Residue:388
BDBM85026
NameBDBM85026
Synonyms:N-(1-Butylpiperidine-4-ylmethyl)-1,2-(trimethyleneoxy)-1H-indole-3-carboxamide SB-207266
TypeSmall organic molecule
Emp. Form.C22H31N3O2
Mol. Mass.369.5004
SMILESCCCCN1CCC(CNC(=O)c2c3OCCCn3c3ccccc23)CC1