Reaction Details
TargetNitric oxide synthase, brain
LigandBDBM152723
Substrate/Competitorn/a
Meas. Tech.ChEMBL_1446355 (CHEMBL3374894)
Ki 21±n/a nM
Citation Jing, QLi, HRoman, LJMartásek, PPoulos, TLSilverman, RB Combination of chiral linkers with thiophenecarboximidamide heads to improve the selectivity of inhibitors of neuronal nitric oxide synthase. Bioorg Med Chem Lett24:4504-10 (2014) 
 
Nitric oxide synthase, brain
Name:Nitric oxide synthase, brain
Type:Enzyme
Mol. Mass.:160570.98
Organism:Rattus norvegicus (rat)
Description:Recombinant nNOS overexpressed in E. coli was used in enzyme assays.
Residue:1429
BDBM152723
NameBDBM152723
Synonyms:N-[3-({[(3S,5R)-5-({[3-(thiophene-2-imidamido)phenyl]methoxy}methyl)pyrrolidin-3-yl]oxy}methyl)phenyl]-2H-1λ⁴-thiophene-2-carboximidamide (28)
TypeSmall organic molecule
Emp. Form.C29H31N5O2S2
Mol. Mass.545.719
SMILESN=C(Nc1cccc(COC[C@H]2C[C@@H](CN2)OCc2cccc(NC(=N)c3cccs3)c2)c1)c1cccs1