Reaction Details
TargetLysophosphatidic acid receptor 1
LigandBDBM50023473
Substrate/Competitorn/a
Meas. Tech.ChEMBL_1452484 (CHEMBL3362833)
IC50 74±n/a nM
Citation Sidduri, ABudd, DCFuentes, MELambros, TRen, YRoongta, VSchoenfeld, RCGillespie, PStevenson, CSTruitt, TQian, Y Discovery of novel non-carboxylic acid 5-amino-4-cyanopyrazole derivatives as potent and highly selective LPA1R antagonists. Bioorg Med Chem Lett24:4450-4 (2014) 
 
Lysophosphatidic acid receptor 1
Name:Lysophosphatidic acid receptor 1
Type:Enzyme
Mol. Mass.:41120.55
Organism:Homo sapiens (Human)
Description:Q92633
Residue:364
BDBM50023473
NameBDBM50023473
Synonyms:CHEMBL3326527
TypeSmall organic molecule
Emp. Form.C18H18FN5O2
Mol. Mass.355.3662
SMILESCOc1ccc(C(=O)C(=N/C2CCCC2)\n2ncc(C#N)c2N)c(F)c1