Reaction Details
TargetPotassium voltage-gated channel subfamily KQT member 1
LigandBDBM50023589
Substrate/Competitorn/a
Meas. Tech.ChEMBL_1454245 (CHEMBL3363795)
IC50>333000±n/a nM
Citation Reck, FEhmann, DEDougherty, TJNewman, JVHopkins, SStone, GAgrawal, NCiaccio, PMcNulty, JBarthlow, HO'Donnell, JGoteti, KBreen, JComita-Prevoir, JCornebise, MCronin, MEyermann, CJGeng, BCarr, GRPandarinathan, LTang, XCottone, AZhao, LBezdenejnih-Snyder, N Optimization of physicochemical properties and safety profile of novel bacterial topoisomerase type II inhibitors (NBTIs) with activity against Pseudomonas aeruginosa. Bioorg Med Chem22:5392-409 (2014) 
 
Potassium voltage-gated channel subfamily KQT member 1
Name:Potassium voltage-gated channel subfamily KQT member 1
Type:PROTEIN
Mol. Mass.:74739.00
Organism:Homo sapiens (Human)
Description:ChEMBL_1454245
Residue:676
BDBM50023589
NameBDBM50023589
Synonyms:CHEMBL3355573
TypeSmall organic molecule
Emp. Form.C23H26FN7O3
Mol. Mass.467.496
SMILES[H][C@@]1(CC[C@@H](CC1)NCc1ncc2OCC(=O)Nc2n1)[C@@H](N)Cn1c2cc(F)ccc2ncc1=O