Reaction Details
TargetPotassium voltage-gated channel subfamily D member 3
LigandBDBM50023589
Substrate/Competitorn/a
Meas. Tech.ChEMBL_1454247 (CHEMBL3363797)
IC50>100000±n/a nM
Citation Reck, FEhmann, DEDougherty, TJNewman, JVHopkins, SStone, GAgrawal, NCiaccio, PMcNulty, JBarthlow, HO'Donnell, JGoteti, KBreen, JComita-Prevoir, JCornebise, MCronin, MEyermann, CJGeng, BCarr, GRPandarinathan, LTang, XCottone, AZhao, LBezdenejnih-Snyder, N Optimization of physicochemical properties and safety profile of novel bacterial topoisomerase type II inhibitors (NBTIs) with activity against Pseudomonas aeruginosa. Bioorg Med Chem22:5392-409 (2014) 
 
Potassium voltage-gated channel subfamily D member 3
Name:Potassium voltage-gated channel subfamily D member 3
Type:PROTEIN
Mol. Mass.:73464.62
Organism:Homo sapiens (Human)
Description:ChEMBL_1478652
Residue:655
BDBM50023589
NameBDBM50023589
Synonyms:CHEMBL3355573
TypeSmall organic molecule
Emp. Form.C23H26FN7O3
Mol. Mass.467.496
SMILES[H][C@@]1(CC[C@@H](CC1)NCc1ncc2OCC(=O)Nc2n1)[C@@H](N)Cn1c2cc(F)ccc2ncc1=O