Reaction Details
TargetCarbonic anhydrase 12
LigandBDBM50023600
Substrate/Competitorn/a
Meas. Tech.ChEMBL_1454280 (CHEMBL3363830)
Ki 126±n/a nM
Citation Riafrecha, LERodríguez, OMVullo, DSupuran, CTColinas, PA Attachment of carbohydrates to methoxyaryl moieties leads to highly selective inhibitors of the cancer associated carbonic anhydrase isoforms IX and XII. Bioorg Med Chem22:5308-14 (2014) 
 
Carbonic anhydrase 12
Name:Carbonic anhydrase 12
Type:Enzyme
Mol. Mass.:39456.00
Organism:Homo sapiens (Human)
Description:Catalytic domain of human cloned isozyme was used in the assay
Residue:354
BDBM50023600
NameBDBM50023600
Synonyms:CHEMBL3329922
TypeSmall organic molecule
Emp. Form.C26H32O12
Mol. Mass.536.5251
SMILESCOc1ccc(\C=C\C(=O)C[C@@H]2O[C@H](COC(C)=O)[C@@H](OC(C)=O)[C@H](OC(C)=O)[C@H]2OC(C)=O)cc1OC