Reaction Details
TargetCarbonic anhydrase 12
LigandBDBM50023598
Substrate/Competitorn/a
Meas. Tech.ChEMBL_1454280 (CHEMBL3363830)
Ki 89±n/a nM
Citation Riafrecha, LERodríguez, OMVullo, DSupuran, CTColinas, PA Attachment of carbohydrates to methoxyaryl moieties leads to highly selective inhibitors of the cancer associated carbonic anhydrase isoforms IX and XII. Bioorg Med Chem22:5308-14 (2014) 
 
Carbonic anhydrase 12
Name:Carbonic anhydrase 12
Type:Enzyme
Mol. Mass.:39456.00
Organism:Homo sapiens (Human)
Description:Catalytic domain of human cloned isozyme was used in the assay
Residue:354
BDBM50023598
NameBDBM50023598
Synonyms:CHEMBL3329931
TypeSmall organic molecule
Emp. Form.C21H24O7
Mol. Mass.388.4111
SMILESCOc1ccc2cc(\C=C\C(=O)C[C@@H]3O[C@H](CO)[C@H](O)[C@H](O)[C@H]3O)ccc2c1