Reaction Details
TargetCarbonic anhydrase 2
LigandBDBM50023600
Substrate/Competitorn/a
Meas. Tech.ChEMBL_1454278 (CHEMBL3363828)
Ki 541±n/a nM
Citation Riafrecha, LERodríguez, OMVullo, DSupuran, CTColinas, PA Attachment of carbohydrates to methoxyaryl moieties leads to highly selective inhibitors of the cancer associated carbonic anhydrase isoforms IX and XII. Bioorg Med Chem22:5308-14 (2014) 
 
Carbonic anhydrase 2
Name:Carbonic anhydrase 2
Type:Enzyme
Mol. Mass.:29250.71
Organism:Homo sapiens (Human)
Description:P00918
Residue:260
BDBM50023600
NameBDBM50023600
Synonyms:CHEMBL3329922
TypeSmall organic molecule
Emp. Form.C26H32O12
Mol. Mass.536.5251
SMILESCOc1ccc(\C=C\C(=O)C[C@@H]2O[C@H](COC(C)=O)[C@@H](OC(C)=O)[C@H](OC(C)=O)[C@H]2OC(C)=O)cc1OC