Reaction Details
TargetCarbonic anhydrase 1
LigandBDBM50023603
Substrate/Competitorn/a
Meas. Tech.ChEMBL_1454277 (CHEMBL3363827)
Ki 8670±n/a nM
Citation Riafrecha, LERodríguez, OMVullo, DSupuran, CTColinas, PA Attachment of carbohydrates to methoxyaryl moieties leads to highly selective inhibitors of the cancer associated carbonic anhydrase isoforms IX and XII. Bioorg Med Chem22:5308-14 (2014) 
 
Carbonic anhydrase 1
Name:Carbonic anhydrase 1
Type:Enzyme
Mol. Mass.:28873.37
Organism:Homo sapiens (Human)
Description:P00915
Residue:261
BDBM50023603
NameBDBM50023603
Synonyms:CHEMBL3329929
TypeSmall organic molecule
Emp. Form.C17H22O7
Mol. Mass.338.3524
SMILESCOc1cccc(\C=C\C(=O)C[C@@H]2O[C@H](CO)[C@H](O)[C@H](O)[C@H]2O)c1