Reaction Details
TargetEnv polyprotein
LigandBDBM50346601
Substrate/Competitorn/a
Meas. Tech.ChEMBL_1455137 (CHEMBL3366750)
EC50>100000±n/a nM
Citation Wang, CLu, LNa, HLi, XWang, QJiang, XXu, XYu, FZhang, TLi, JZhang, ZZheng, BLiang, GCai, LJiang, SLiu, K Conjugation of a nonspecific antiviral sapogenin with a specific HIV fusion inhibitor: a promising strategy for discovering new antiviral therapeutics. J Med Chem57:7342-54 (2014) 
 
Env polyprotein
Name:Env polyprotein
Type:PROTEIN
Mol. Mass.:14017.92
Organism:Human immunodeficiency virus 1
Description:ChEMBL_109731
Residue:124
BDBM50346601
NameBDBM50346601
Synonyms:NSC-114945 Oleanolic acid US11660306, Example Oleanolic acid
TypeSmall organic molecule
Emp. Form.C30H48O3
Mol. Mass.456.7003
SMILESCC1(C)CC[C@@]2(CC[C@]3(C)C(=CC[C@@H]4[C@@]5(C)CC[C@H](O)C(C)(C)[C@@H]5CC[C@@]34C)[C@@H]2C1)C(O)=O