Reaction Details
TargetEnv polyprotein
LigandBDBM50023623
Substrate/Competitorn/a
Meas. Tech.ChEMBL_1455142 (CHEMBL3366755)
EC50 117±n/a nM
Citation Wang, CLu, LNa, HLi, XWang, QJiang, XXu, XYu, FZhang, TLi, JZhang, ZZheng, BLiang, GCai, LJiang, SLiu, K Conjugation of a nonspecific antiviral sapogenin with a specific HIV fusion inhibitor: a promising strategy for discovering new antiviral therapeutics. J Med Chem57:7342-54 (2014) 
 
Env polyprotein
Name:Env polyprotein
Type:PROTEIN
Mol. Mass.:14017.92
Organism:Human immunodeficiency virus 1
Description:ChEMBL_109731
Residue:124
BDBM50023623
NameBDBM50023623
Synonyms:CHEMBL3341847
TypeSmall organic molecule
Emp. Form.C171H268N42O55
Mol. Mass.3792.206
SMILES[H][C@]12[C@@H](CC[C@@]1(CC[C@]1(C)[C@]2([H])CC[C@]2([H])[C@@]3(C)CC[C@H](OC(=O)CCc4cn(CC(=O)NCCC(=O)N[C@@H](CC(N)=O)C(=O)N[C@@H](CC(N)=O)C(=O)N[C@@H](Cc5ccc(O)cc5)C(=O)N[C@@H]([C@@H](C)O)C(=O)N[C@@H](CO)C(=O)N[C@@H](CC(C)C)C(=O)N[C@@H]([C@@H](C)CC)C(=O)N[C@@H](Cc5cnc[nH]5)C(=O)N[C@@H](CO)C(=O)N[C@@H](CC(C)C)C(=O)N[C@@H]([C@@H](C)CC)C(=O)N[C@@H](CCC(O)=O)C(=O)N[C@@H](CCC(O)=O)C(=O)N[C@@H](CO)C(=O)N[C@@H](CCC(N)=O)C(=O)N[C@@H](CC(N)=O)C(=O)N[C@@H](CCC(N)=O)C(=O)N[C@@H](CCC(N)=O)C(=O)N[C@@H](CCC(O)=O)C(=O)N[C@@H](CCCCN)C(=O)N[C@@H](CC(N)=O)C(=O)N[C@@H](CCC(O)=O)C(=O)N[C@@H](CCC(N)=O)C(=O)N[C@@H](CCC(O)=O)C(=O)N[C@@H](CC(C)C)C(=O)N[C@@H](CC(C)C)C(N)=O)nn4)C(C)(C)[C@]3([H])CC[C@@]12C)C(O)=O)C(C)=C