Reaction Details
TargetNeurotensin receptor type 1
LigandBDBM85050
Substrate/Competitorn/a
Meas. Tech.ChEMBL_1455171 (CHEMBL3361463)
Ki 1.4±n/a nM
Citation Thomas, JBGiddings, AMWiethe, RWOlepu, SWarner, KRSarret, PGendron, LLongpre, JMZhang, YRunyon, SPGilmour, BP Identification of N-[(5-{[(4-methylphenyl)sulfonyl]amino}-3-(trifluoroacetyl)-1H-indol-1-yl)acetyl]-l-leucine (NTRC-824), a neurotensin-like nonpeptide compound selective for the neurotensin receptor type 2. J Med Chem57:7472-7 (2014) 
 
Neurotensin receptor type 1
Name:Neurotensin receptor type 1
Type:PROTEIN
Mol. Mass.:47070.64
Organism:Rattus norvegicus
Description:ChEMBL_1466612
Residue:424
BDBM85050
NameBDBM85050
Synonyms:CAS_184162-64-9 SR142948 | SR142948A
TypeSmall organic molecule
Emp. Form.C39H51N5O6
Mol. Mass.685.8521
SMILES[H]C12CC3([H])CC([H])(C1)C(NC(=O)c1cc(-c4c(OC)cccc4OC)n(n1)-c1ccc(cc1C(C)C)C(=O)N(C)CCCN(C)C)(C(O)=O)C([H])(C2)C3