Reaction Details
TargetNeurotensin receptor type 2
LigandBDBM50023628
Substrate/Competitorn/a
Meas. Tech.ChEMBL_1455170 (CHEMBL3361462)
IC50 38±n/a nM
Citation Thomas, JBGiddings, AMWiethe, RWOlepu, SWarner, KRSarret, PGendron, LLongpre, JMZhang, YRunyon, SPGilmour, BP Identification of N-[(5-{[(4-methylphenyl)sulfonyl]amino}-3-(trifluoroacetyl)-1H-indol-1-yl)acetyl]-l-leucine (NTRC-824), a neurotensin-like nonpeptide compound selective for the neurotensin receptor type 2. J Med Chem57:7472-7 (2014) 
 
Neurotensin receptor type 2
Name:Neurotensin receptor type 2
Type:PROTEIN
Mol. Mass.:46280.50
Organism:Rattus norvegicus
Description:ChEMBL_1466615
Residue:416
BDBM50023628
NameBDBM50023628
Synonyms:CHEMBL3326831
TypeSmall organic molecule
Emp. Form.C25H26F3N3O6S
Mol. Mass.553.551
SMILESCC(C)C[C@H](NC(=O)Cn1cc(C(=O)C(F)(F)F)c2cc(NS(=O)(=O)c3ccc(C)cc3)ccc12)C(O)=O