Reaction Details
TargetCannabinoid receptor 1
LigandBDBM50023666
Substrate/Competitorn/a
Meas. Tech.ChEMBL_1456022 (CHEMBL3366078)
EC50 1520±n/a nM
Citation German, NDecker, AMGilmour, BPGay, EAWiley, JLThomas, BFZhang, Y Diarylureas as allosteric modulators of the cannabinoid CB1 receptor: structure-activity relationship studies on 1-(4-chlorophenyl)-3-{3-[6-(pyrrolidin-1-yl)pyridin-2-yl]phenyl}urea (PSNCBAM-1). J Med Chem57:7758-69 (2014) 
 
Cannabinoid receptor 1
Name:Cannabinoid receptor 1
Type:G Protein-Coupled Receptor (GPCR)
Mol. Mass.:52868.96
Organism:Homo sapiens (Human)
Description:P21554
Residue:472
BDBM50023666
NameBDBM50023666
Synonyms:CHEMBL3341869
TypeSmall organic molecule
Emp. Form.C22H23ClN4O
Mol. Mass.394.897
SMILESCCCCNc1cccc(n1)-c1cccc(NC(=O)Nc2ccc(Cl)cc2)c1