Reaction Details
TargetCannabinoid receptor 2
LigandBDBM50023634
Substrate/Competitorn/a
Meas. Tech.ChEMBL_1456019 (CHEMBL3366075)
IC50>10000±n/a nM
Citation German, NDecker, AMGilmour, BPGay, EAWiley, JLThomas, BFZhang, Y Diarylureas as allosteric modulators of the cannabinoid CB1 receptor: structure-activity relationship studies on 1-(4-chlorophenyl)-3-{3-[6-(pyrrolidin-1-yl)pyridin-2-yl]phenyl}urea (PSNCBAM-1). J Med Chem57:7758-69 (2014) 
 
Cannabinoid receptor 2
Name:Cannabinoid receptor 2
Type:G Protein-Coupled Receptor (GPCR)
Mol. Mass.:39690.94
Organism:Homo sapiens (Human)
Description:P34972
Residue:360
BDBM50023634
NameBDBM50023634
Synonyms:CHEMBL3341886
TypeSmall organic molecule
Emp. Form.C25H28N4O4
Mol. Mass.448.5142
SMILESCOc1cc(NC(=O)Nc2cccc(c2)-c2cccc(n2)N2CCCC2)cc(OC)c1OC